Reaction Details
TargetCathepsin D
LigandBDBM50055936
Substrate/Competitorn/a
Meas. Tech.ChEMBL_1458603 (CHEMBL3371146)
IC50 120±n/a nM
Citation Grädler, UCzodrowski, PTsaklakidis, CKlein, MWerkmann, DLindemann, SMaskos, KLeuthner, B Structure-based optimization of non-peptidic Cathepsin D inhibitors. Bioorg Med Chem Lett24:4141-50 (2014) 
 
Cathepsin D
Name:Cathepsin D
Type:Enzyme
Mol. Mass.:44551.72
Organism:Homo sapiens (Human)
Description:Human proCathepsin D (SwissProt accession number P07339) was expressed in Sf9 cells, purified, and autoactivated.
Residue:412
BDBM50055936
NameBDBM50055936
Synonyms:CHEMBL3321926 | US9884814, Compound 25
TypeSmall organic molecule
Emp. Form.C29H40N4O6
Mol. Mass.540.6511
SMILESCOc1ccc(CNC(=O)[C@@H](CC2CCCCC2)NC(=N)NC(=O)Cc2ccc(OC)c(OC)c2)cc1OC