Reaction Details
TargetAcetylcholinesterase
LigandBDBM50056126
Substrate/Competitorn/a
Meas. Tech.ChEMBL_1447985 (CHEMBL3379811)
Ki 80±n/a nM
Citation Hamulakova, SJanovec, LHrabinova, MSpilovska, KKorabecny, JKristian, PKuca, KImrich, J Synthesis and biological evaluation of novel tacrine derivatives and tacrine-coumarin hybrids as cholinesterase inhibitors. J Med Chem57:7073-84 (2014) 
 
Acetylcholinesterase
Name:Acetylcholinesterase
Type:Enzyme
Mol. Mass.:67792.70
Organism:Homo sapiens (Human)
Description:P22303
Residue:614
BDBM50056126
NameBDBM50056126
Synonyms:CHEMBL3322141
TypeSmall organic molecule
Emp. Form.C27H40N4O
Mol. Mass.436.6327
SMILESCCN(CCC(=O)NCCCNc1c2CCCCc2nc2ccccc12)C1CCCCC1