Reaction Details
TargetAcetylcholinesterase
LigandBDBM50056127
Substrate/Competitorn/a
Meas. Tech.ChEMBL_1447985 (CHEMBL3379811)
Ki 199±n/a nM
Citation Hamulakova, SJanovec, LHrabinova, MSpilovska, KKorabecny, JKristian, PKuca, KImrich, J Synthesis and biological evaluation of novel tacrine derivatives and tacrine-coumarin hybrids as cholinesterase inhibitors. J Med Chem57:7073-84 (2014) 
 
Acetylcholinesterase
Name:Acetylcholinesterase
Type:Enzyme
Mol. Mass.:67792.70
Organism:Homo sapiens (Human)
Description:P22303
Residue:614
BDBM50056127
NameBDBM50056127
Synonyms:CHEMBL3322142
TypeSmall organic molecule
Emp. Form.C28H42N4O
Mol. Mass.450.6593
SMILESCCN(CCC(=O)NCCCCNc1c2CCCCc2nc2ccccc12)C1CCCCC1