Reaction Details
TargetAcetylcholinesterase
LigandBDBM50056134
Substrate/Competitorn/a
Meas. Tech.ChEMBL_1447986 (CHEMBL3379812)
Ki 23±n/a nM
Citation Hamulakova, SJanovec, LHrabinova, MSpilovska, KKorabecny, JKristian, PKuca, KImrich, J Synthesis and biological evaluation of novel tacrine derivatives and tacrine-coumarin hybrids as cholinesterase inhibitors. J Med Chem57:7073-84 (2014) 
 
Acetylcholinesterase
Name:Acetylcholinesterase
Type:Enzyme
Mol. Mass.:67792.70
Organism:Homo sapiens (Human)
Description:P22303
Residue:614
BDBM50056134
NameBDBM50056134
Synonyms:CHEMBL3322160
TypeSmall organic molecule
Emp. Form.C28H29N3O4
Mol. Mass.471.5476
SMILESOc1ccc2c(CC(=O)NCCCCNc3c4CCCCc4nc4ccccc34)cc(=O)oc2c1