Reaction Details
TargetGlycogen phosphorylase, muscle form
LigandBDBM50351158
Substrate/Competitorn/a
Meas. Tech.ChEMBL_1449751 (CHEMBL3378174)
Ki 1700000±n/a nM
Citation Parmenopoulou, VKantsadi, ALTsirkone, VGChatzileontiadou, DSManta, SZographos, SEMolfeta, CArchontis, GAgius, LHayes, JMLeonidas, DDKomiotis, D Structure based inhibitor design targeting glycogen phosphorylase B. Virtual screening, synthesis, biochemical and biological assessment of novel N-acyl-ß-d-glucopyranosylamines. Bioorg Med Chem22:4810-25 (2014) 
 
Glycogen phosphorylase, muscle form
Name:Glycogen phosphorylase, muscle form
Type:PROTEIN
Mol. Mass.:97097.45
Organism:Homo sapiens (Human)
Description:ChEMBL_1449751
Residue:842
BDBM50351158
NameBDBM50351158
Synonyms:CHEMBL423707
TypeSmall organic molecule
Emp. Form.C6H12O6
Mol. Mass.180.1559
SMILESOC[C@H]1O[C@H](O)[C@H](O)[C@@H](O)[C@@H]1O