Reaction Details
TargetGlycogen phosphorylase, liver form
LigandBDBM50149207
Substrate/Competitorn/a
Meas. Tech.ChEMBL_1449752 (CHEMBL3378175)
IC50 6.0±n/a nM
Citation Parmenopoulou, VKantsadi, ALTsirkone, VGChatzileontiadou, DSManta, SZographos, SEMolfeta, CArchontis, GAgius, LHayes, JMLeonidas, DDKomiotis, D Structure based inhibitor design targeting glycogen phosphorylase B. Virtual screening, synthesis, biochemical and biological assessment of novel N-acyl-ß-d-glucopyranosylamines. Bioorg Med Chem22:4810-25 (2014) 
 
Glycogen phosphorylase, liver form
Name:Glycogen phosphorylase, liver form
Type:Homodimer
Mol. Mass.:97153.98
Organism:Homo sapiens (Human)
Description:Dimers associate into a tetramer to form the enzymatically active phosphorylase A.
Residue:847
BDBM50149207
NameBDBM50149207
Synonyms:2N-(2-{2-[2-(5-chloro-1H-2-indolylcarboxamido)ethoxy]ethoxy}ethyl)-5-chloro-1H-2-indolecarboxamide CHEMBL434025
TypeSmall organic molecule
Emp. Form.C24H24Cl2N4O4
Mol. Mass.503.378
SMILESClc1ccc2[nH]c(cc2c1)C(=O)NCCOCCOCCNC(=O)c1cc2cc(Cl)ccc2[nH]1