Reaction Details
TargetActivin receptor type-1
LigandBDBM50056680
Substrate/Competitorn/a
Meas. Tech.ChEMBL_1453217 (CHEMBL3365510)
IC50 10.0±n/a nM
Citation Mohedas, AHWang, YSanvitale, CECanning, PChoi, SXing, XBullock, ANCuny, GDYu, PB Structure-activity relationship of 3,5-diaryl-2-aminopyridine ALK2 inhibitors reveals unaltered binding affinity for fibrodysplasia ossificans progressiva causing mutants. J Med Chem57:7900-15 (2014) 
 
Activin receptor type-1
Name:Activin receptor type-1
Type:n/a
Mol. Mass.:57158.32
Organism:Homo sapiens (Human)
Description:n/a
Residue:509
BDBM50056680
NameBDBM50056680
Synonyms:CHEMBL3341794
TypeSmall organic molecule
Emp. Form.C25H27N5O3
Mol. Mass.445.5136
SMILESCOc1cc(cc(OC)c1OC)-c1cnn2cc(cnc12)-c1ccc(cc1)N1CCNCC1