Reaction Details
TargetCarbonic anhydrase 2
LigandBDBM50057408
Substrate/Competitorn/a
Meas. Tech.ChEMBL_1460336 (CHEMBL3370491)
Ki 950000±n/a nM
Citation Martin, DPBlachly, PGMcCammon, JACohen, SM Exploring the influence of the protein environment on metal-binding pharmacophores. J Med Chem57:7126-35 (2014) 
 
Carbonic anhydrase 2
Name:Carbonic anhydrase 2
Type:Enzyme
Mol. Mass.:29250.71
Organism:Homo sapiens (Human)
Description:P00918
Residue:260
BDBM50057408
NameBDBM50057408
Synonyms:CHEMBL3326433
TypeSmall organic molecule
Emp. Form.C7H9NOS
Mol. Mass.155.217
SMILESCc1cc(C)n(O)c(=S)c1