Reaction Details
TargetCarbonic anhydrase 2
LigandBDBM50057410
Substrate/Competitorn/a
Meas. Tech.ChEMBL_1460336 (CHEMBL3370491)
Ki 260000±n/a nM
Citation Martin, DPBlachly, PGMcCammon, JACohen, SM Exploring the influence of the protein environment on metal-binding pharmacophores. J Med Chem57:7126-35 (2014) 
 
Carbonic anhydrase 2
Name:Carbonic anhydrase 2
Type:Enzyme
Mol. Mass.:29250.71
Organism:Homo sapiens (Human)
Description:P00918
Residue:260
BDBM50057410
NameBDBM50057410
Synonyms:CHEMBL3326431
TypeSmall organic molecule
Emp. Form.C6H7NOS
Mol. Mass.141.191
SMILESCc1ccc(=S)n(O)c1