Reaction Details
TargetDNA gyrase subunit B
LigandBDBM50058510
Substrate/Competitorn/a
Meas. Tech.ChEMBL_1448968 (CHEMBL3376315)
IC50 41±n/a nM
Citation Yule, IACzaplewski, LGPommier, SDavies, DTNarramore, SKFishwick, CW Pyridine-3-carboxamide-6-yl-ureas as novel inhibitors of bacterial DNA gyrase: structure based design, synthesis, SAR and antimicrobial activity. Eur J Med Chem86:31-8 (2014) 
 
DNA gyrase subunit B
Name:DNA gyrase subunit B
Type:Enzyme Subunit
Mol. Mass.:72530.91
Organism:Staphylococcus aureus
Description:n/a
Residue:644
BDBM50058510
NameBDBM50058510
Synonyms:CHEMBL3329319
TypeSmall organic molecule
Emp. Form.C22H24N6O4
Mol. Mass.436.4638
SMILESCCNC(=O)Nc1cc(Nc2ccc(OC)cc2OC)c(cn1)C(=O)Nc1cccnc1