Reaction Details
TargetMitogen-activated protein kinase kinase kinase 12
LigandBDBM50059196
Substrate/Competitorn/a
Meas. Tech.ChEMBL_1460554 (CHEMBL3395586)
IC50 1600±n/a nM
Citation Patel, SCohen, FDean, BJDe La Torre, KDeshmukh, GEstrada, AAGhosh, ASGibbons, PGustafson, AHuestis, MPLe Pichon, CELin, HLiu, WLiu, XLiu, YLy, CQLyssikatos, JPMa, CScearce-Levie, KShin, YGSolanoy, HStark, KLWang, JWang, BZhao, XLewcock, JWSiu, M Discovery of dual leucine zipper kinase (DLK, MAP3K12) inhibitors with activity in neurodegeneration models. J Med Chem58:401-18 (2015) 
 
Mitogen-activated protein kinase kinase kinase 12
Name:Mitogen-activated protein kinase kinase kinase 12
Type:PROTEIN
Mol. Mass.:93216.56
Organism:Homo sapiens (Human)
Description:ChEMBL_1460553
Residue:859
BDBM50059196
NameBDBM50059196
Synonyms:CHEMBL3393338
TypeSmall organic molecule
Emp. Form.C20H23N5O
Mol. Mass.349.4295
SMILESCc1cc(cc(Nc2cc(ccn2)C#N)n1)C1CCN(CC1)C1COC1