Reaction Details
TargetMitogen-activated protein kinase kinase kinase 12
LigandBDBM50059201
Substrate/Competitorn/a
Meas. Tech.ChEMBL_1460554 (CHEMBL3395586)
IC50 70±n/a nM
Citation Patel, SCohen, FDean, BJDe La Torre, KDeshmukh, GEstrada, AAGhosh, ASGibbons, PGustafson, AHuestis, MPLe Pichon, CELin, HLiu, WLiu, XLiu, YLy, CQLyssikatos, JPMa, CScearce-Levie, KShin, YGSolanoy, HStark, KLWang, JWang, BZhao, XLewcock, JWSiu, M Discovery of dual leucine zipper kinase (DLK, MAP3K12) inhibitors with activity in neurodegeneration models. J Med Chem58:401-18 (2015) 
 
Mitogen-activated protein kinase kinase kinase 12
Name:Mitogen-activated protein kinase kinase kinase 12
Type:PROTEIN
Mol. Mass.:93216.56
Organism:Homo sapiens (Human)
Description:ChEMBL_1460553
Residue:859
BDBM50059201
NameBDBM50059201
Synonyms:CHEMBL3393329
TypeSmall organic molecule
Emp. Form.C20H21F2N5O
Mol. Mass.385.4104
SMILESFC1(F)CCN(C1)c1cc(cc(Nc2cc(ccn2)C#N)n1)C1CCOCC1