Reaction Details
TargetMitogen-activated protein kinase kinase kinase 12
LigandBDBM50059205
Substrate/Competitorn/a
Meas. Tech.ChEMBL_1460554 (CHEMBL3395586)
IC50 410±n/a nM
Citation Patel, SCohen, FDean, BJDe La Torre, KDeshmukh, GEstrada, AAGhosh, ASGibbons, PGustafson, AHuestis, MPLe Pichon, CELin, HLiu, WLiu, XLiu, YLy, CQLyssikatos, JPMa, CScearce-Levie, KShin, YGSolanoy, HStark, KLWang, JWang, BZhao, XLewcock, JWSiu, M Discovery of dual leucine zipper kinase (DLK, MAP3K12) inhibitors with activity in neurodegeneration models. J Med Chem58:401-18 (2015) 
 
Mitogen-activated protein kinase kinase kinase 12
Name:Mitogen-activated protein kinase kinase kinase 12
Type:PROTEIN
Mol. Mass.:93216.56
Organism:Homo sapiens (Human)
Description:ChEMBL_1460553
Residue:859
BDBM50059205
NameBDBM50059205
Synonyms:CHEMBL3393322 | US9868720, No. 92
TypeSmall organic molecule
Emp. Form.C19H21F5N6
Mol. Mass.428.4023
SMILESFC(F)(F)c1ccnc(Nc2cc(nc(n2)N2CCC(F)(F)C2)C2CCNCC2)c1