Reaction Details
TargetAurora kinase B
LigandBDBM50059431
Substrate/Competitorn/a
Meas. Tech.ChEMBL_1460906 (CHEMBL3396726)
IC50 5.0±n/a nM
Citation Carry, JCClerc, FMinoux, HSchio, LMauger, JNair, AParmantier, ELe Moigne, RDelorme, CNicolas, JPKrick, AAbécassis, PYCrocq-Stuerga, VPouzieux, SDelarbre, LMaignan, SBertrand, TBjergarde, KMa, NLachaud, SGuizani, HLebel, RDoerflinger, GMonget, SPerron, SGasse, FAngouillant-Boniface, OFiloche-Rommé, BMurer, MGontier, SPrévost, CMonteiro, MLCombeau, C SAR156497, an exquisitely selective inhibitor of aurora kinases. J Med Chem58:362-75 (2015) 
 
Aurora kinase B
Name:Aurora kinase B
Type:Protein
Mol. Mass.:39327.72
Organism:Homo sapiens (Human)
Description:Q96GD4
Residue:344
BDBM50059431
NameBDBM50059431
Synonyms:CHEMBL3393487
TypeSmall organic molecule
Emp. Form.C24H20ClN5O4S
Mol. Mass.509.965
SMILESCCOC(=O)c1[nH]cc2C(c3ccc(Sc4nc5cccc(Cl)c5[nH]4)o3)C3=C(CNCC3=O)Nc12