Reaction Details
TargetAurora kinase B
LigandBDBM50059433
Substrate/Competitorn/a
Meas. Tech.ChEMBL_1460906 (CHEMBL3396726)
IC50 4.0±n/a nM
Citation Carry, JCClerc, FMinoux, HSchio, LMauger, JNair, AParmantier, ELe Moigne, RDelorme, CNicolas, JPKrick, AAbécassis, PYCrocq-Stuerga, VPouzieux, SDelarbre, LMaignan, SBertrand, TBjergarde, KMa, NLachaud, SGuizani, HLebel, RDoerflinger, GMonget, SPerron, SGasse, FAngouillant-Boniface, OFiloche-Rommé, BMurer, MGontier, SPrévost, CMonteiro, MLCombeau, C SAR156497, an exquisitely selective inhibitor of aurora kinases. J Med Chem58:362-75 (2015) 
 
Aurora kinase B
Name:Aurora kinase B
Type:Protein
Mol. Mass.:39327.72
Organism:Homo sapiens (Human)
Description:Q96GD4
Residue:344
BDBM50059433
NameBDBM50059433
Synonyms:CHEMBL3393485
TypeSmall organic molecule
Emp. Form.C26H25ClN6O5S
Mol. Mass.569.032
SMILESCl.CCOC(=O)c1[nH]cc2[C@H](c3ccc(Sc4nc5ccccc5[nH]4)o3)C3=C(CN(CC3=O)C(=O)CN)Nc12