Reaction Details
TargetAurora kinase B
LigandBDBM50059440
Substrate/Competitorn/a
Meas. Tech.ChEMBL_1460906 (CHEMBL3396726)
IC50 26±n/a nM
Citation Carry, JCClerc, FMinoux, HSchio, LMauger, JNair, AParmantier, ELe Moigne, RDelorme, CNicolas, JPKrick, AAbécassis, PYCrocq-Stuerga, VPouzieux, SDelarbre, LMaignan, SBertrand, TBjergarde, KMa, NLachaud, SGuizani, HLebel, RDoerflinger, GMonget, SPerron, SGasse, FAngouillant-Boniface, OFiloche-Rommé, BMurer, MGontier, SPrévost, CMonteiro, MLCombeau, C SAR156497, an exquisitely selective inhibitor of aurora kinases. J Med Chem58:362-75 (2015) 
 
Aurora kinase B
Name:Aurora kinase B
Type:Protein
Mol. Mass.:39327.72
Organism:Homo sapiens (Human)
Description:Q96GD4
Residue:344
BDBM50059440
NameBDBM50059440
Synonyms:CHEMBL3393490
TypeSmall organic molecule
Emp. Form.C29H29N5O6S
Mol. Mass.575.635
SMILESCCOC(=O)c1[nH]cc2C(c3ccc(Sc4nc5ccccc5[nH]4)o3)C3=C(CN(CC3=O)C(=O)OC(C)(C)C)Nc12