Reaction Details
TargetCytochrome P450 3A4
LigandBDBM50059433
Substrate/Competitorn/a
Meas. Tech.ChEMBL_1460909 (CHEMBL3396729)
IC50 500±n/a nM
Citation Carry, JCClerc, FMinoux, HSchio, LMauger, JNair, AParmantier, ELe Moigne, RDelorme, CNicolas, JPKrick, AAbécassis, PYCrocq-Stuerga, VPouzieux, SDelarbre, LMaignan, SBertrand, TBjergarde, KMa, NLachaud, SGuizani, HLebel, RDoerflinger, GMonget, SPerron, SGasse, FAngouillant-Boniface, OFiloche-Rommé, BMurer, MGontier, SPrévost, CMonteiro, MLCombeau, C SAR156497, an exquisitely selective inhibitor of aurora kinases. J Med Chem58:362-75 (2015) 
 
Cytochrome P450 3A4
Name:Cytochrome P450 3A4
Type:Enzyme
Mol. Mass.:57349.57
Organism:Homo sapiens (Human)
Description:n/a
Residue:503
BDBM50059433
NameBDBM50059433
Synonyms:CHEMBL3393485
TypeSmall organic molecule
Emp. Form.C26H25ClN6O5S
Mol. Mass.569.032
SMILESCl.CCOC(=O)c1[nH]cc2[C@H](c3ccc(Sc4nc5ccccc5[nH]4)o3)C3=C(CN(CC3=O)C(=O)CN)Nc12