Reaction Details
TargetAurora kinase B
LigandBDBM50059456
Substrate/Competitorn/a
Meas. Tech.ChEMBL_1460906 (CHEMBL3396726)
IC50 5.0±n/a nM
Citation Carry, JCClerc, FMinoux, HSchio, LMauger, JNair, AParmantier, ELe Moigne, RDelorme, CNicolas, JPKrick, AAbécassis, PYCrocq-Stuerga, VPouzieux, SDelarbre, LMaignan, SBertrand, TBjergarde, KMa, NLachaud, SGuizani, HLebel, RDoerflinger, GMonget, SPerron, SGasse, FAngouillant-Boniface, OFiloche-Rommé, BMurer, MGontier, SPrévost, CMonteiro, MLCombeau, C SAR156497, an exquisitely selective inhibitor of aurora kinases. J Med Chem58:362-75 (2015) 
 
Aurora kinase B
Name:Aurora kinase B
Type:Protein
Mol. Mass.:39327.72
Organism:Homo sapiens (Human)
Description:Q96GD4
Residue:344
BDBM50059456
NameBDBM50059456
Synonyms:CHEMBL3393467
TypeSmall organic molecule
Emp. Form.C24H19N3O4S2
Mol. Mass.477.555
SMILESCOC(=O)c1csc2C(c3ccc(Sc4nc5ccccc5[nH]4)o3)C3=C(CCCC3=O)Nc12