Reaction Details
TargetAurora kinase A
LigandBDBM50059440
Substrate/Competitorn/a
Meas. Tech.ChEMBL_1460905 (CHEMBL3396725)
IC50 6.0±n/a nM
Citation Carry, JCClerc, FMinoux, HSchio, LMauger, JNair, AParmantier, ELe Moigne, RDelorme, CNicolas, JPKrick, AAbécassis, PYCrocq-Stuerga, VPouzieux, SDelarbre, LMaignan, SBertrand, TBjergarde, KMa, NLachaud, SGuizani, HLebel, RDoerflinger, GMonget, SPerron, SGasse, FAngouillant-Boniface, OFiloche-Rommé, BMurer, MGontier, SPrévost, CMonteiro, MLCombeau, C SAR156497, an exquisitely selective inhibitor of aurora kinases. J Med Chem58:362-75 (2015) 
 
Aurora kinase A
Name:Aurora kinase A
Type:Serine/threonine-protein kinase
Mol. Mass.:45830.98
Organism:Homo sapiens (Human)
Description:O14965
Residue:403
BDBM50059440
NameBDBM50059440
Synonyms:CHEMBL3393490
TypeSmall organic molecule
Emp. Form.C29H29N5O6S
Mol. Mass.575.635
SMILESCCOC(=O)c1[nH]cc2C(c3ccc(Sc4nc5ccccc5[nH]4)o3)C3=C(CN(CC3=O)C(=O)OC(C)(C)C)Nc12