Reaction Details
TargetAurora kinase A
LigandBDBM50059452
Substrate/Competitorn/a
Meas. Tech.ChEMBL_1460905 (CHEMBL3396725)
IC50 60±n/a nM
Citation Carry, JCClerc, FMinoux, HSchio, LMauger, JNair, AParmantier, ELe Moigne, RDelorme, CNicolas, JPKrick, AAbécassis, PYCrocq-Stuerga, VPouzieux, SDelarbre, LMaignan, SBertrand, TBjergarde, KMa, NLachaud, SGuizani, HLebel, RDoerflinger, GMonget, SPerron, SGasse, FAngouillant-Boniface, OFiloche-Rommé, BMurer, MGontier, SPrévost, CMonteiro, MLCombeau, C SAR156497, an exquisitely selective inhibitor of aurora kinases. J Med Chem58:362-75 (2015) 
 
Aurora kinase A
Name:Aurora kinase A
Type:Serine/threonine-protein kinase
Mol. Mass.:45830.98
Organism:Homo sapiens (Human)
Description:O14965
Residue:403
BDBM50059452
NameBDBM50059452
Synonyms:CHEMBL3393483
TypeSmall organic molecule
Emp. Form.C25H23N5O4S
Mol. Mass.489.546
SMILESCCOC(=O)c1[nH]cc2C(c3ccc(Sc4nc5c(N)cccc5[nH]4)o3)C3=C(CCCC3=O)Nc12