Reaction Details
TargetDNA-dependent protein kinase catalytic subunit
LigandBDBM50059639
Substrate/Competitorn/a
Meas. Tech.ChEMBL_1460641 (CHEMBL3395882)
IC50 5.00±n/a nM
Citation Andrs, MKorabecny, JJun, DHodny, ZBartek, JKuca, K Phosphatidylinositol 3-Kinase (PI3K) and phosphatidylinositol 3-kinase-related kinase (PIKK) inhibitors: importance of the morpholine ring. J Med Chem58:41-71 (2015) 
 
DNA-dependent protein kinase catalytic subunit
Name:DNA-dependent protein kinase catalytic subunit
Type:Protein
Mol. Mass.:469114.78
Organism:Homo sapiens (Human)
Description:P78527
Residue:4128
BDBM50059639
NameBDBM50059639
Synonyms:CHEMBL3393500
TypeSmall organic molecule
Emp. Form.C26H21NO3S
Mol. Mass.427.515
SMILESCc1ccc2c(oc(cc2=O)N2CCOCC2)c1-c1cccc2c3ccccc3sc12