Reaction Details
TargetSerine-protein kinase ATM
LigandBDBM50059640
Substrate/Competitorn/a
Meas. Tech.ChEMBL_1460642 (CHEMBL3395883)
IC50 6.0±n/a nM
Citation Andrs, MKorabecny, JJun, DHodny, ZBartek, JKuca, K Phosphatidylinositol 3-Kinase (PI3K) and phosphatidylinositol 3-kinase-related kinase (PIKK) inhibitors: importance of the morpholine ring. J Med Chem58:41-71 (2015) 
 
Serine-protein kinase ATM
Name:Serine-protein kinase ATM
Type:Protein
Mol. Mass.:350696.72
Organism:Homo sapiens (Human)
Description:Q13315
Residue:3056
BDBM50059640
NameBDBM50059640
Synonyms:CHEMBL2140173
TypeSmall organic molecule
Emp. Form.C30H33N3O5S
Mol. Mass.547.665
SMILESC[C@H]1CN(CC(=O)Nc2ccc3Sc4c(Cc3c2)cccc4-c2cc(=O)cc(o2)N2CCOCC2)C[C@@H](C)O1