Reaction Details
TargetProtein kinase C epsilon type
LigandBDBM50059765
Substrate/Competitorn/a
Meas. Tech.ChEMBL_1460977 (CHEMBL3396876)
Ki 19±n/a nM
Citation Ann, JYoon, SBaek, JKim, da HLewin, NEHill, CSBlumberg, PMLee, J Design and synthesis of protein kinase C epsilon selective diacylglycerol lactones (DAG-lactones). Eur J Med Chem90:332-41 (2015) 
 
Protein kinase C epsilon type
Name:Protein kinase C epsilon type
Type:Enzyme
Mol. Mass.:83680.45
Organism:Homo sapiens (Human)
Description:The recombinant human PKC enzymes were produced using a baculovirus expression system in SF9 cells
Residue:737
BDBM50059765
NameBDBM50059765
Synonyms:CHEMBL3393746
TypeSmall organic molecule
Emp. Form.C29H52O5
Mol. Mass.480.7202
(=O)OCC1(CO)C\C(=C\CC(C)C)C(=O)O1