Reaction Details
TargetProtein kinase C alpha type
LigandBDBM50107120
Substrate/Competitorn/a
Meas. Tech.ChEMBL_1460981 (CHEMBL3394956)
Ki 46±n/a nM
Citation Ann, JYoon, SBaek, JKim, da HLewin, NEHill, CSBlumberg, PMLee, J Design and synthesis of protein kinase C epsilon selective diacylglycerol lactones (DAG-lactones). Eur J Med Chem90:332-41 (2015) 
 
Protein kinase C alpha type
Name:Protein kinase C alpha type
Type:Enzyme
Mol. Mass.:76755.65
Organism:Homo sapiens (Human)
Description:The recombinant human PKC enzymes were produced using a baculovirus expression system in SF9 cells
Residue:672
BDBM50107120
NameBDBM50107120
Synonyms:(E) 2,2-Dimethyl-propionic acid 2-hydroxymethyl-4-(3-isobutyl-5-methyl-hexylidene)-5-oxo-tetrahydro-furan-2-ylmethyl ester 2,2-Dimethyl-propionic acid 2-hydroxymethyl-4-(3-isobutyl-5-methyl-hexylidene)-5-oxo-tetrahydro-furan-2-ylmethyl ester CHEMBL137386
TypeSmall organic molecule
Emp. Form.C22H38O5
Mol. Mass.382.5341
SMILESCC(C)CC(C\C=C1/CC(CO)(COC(=O)C(C)(C)C)OC1=O)CC(C)C