Reaction Details
TargetHigh affinity nerve growth factor receptor
LigandBDBM50020712
Substrate/Competitorn/a
Meas. Tech.ChEMBL_1460687 (CHEMBL3396018)
Kd 2100000±n/a nM
Citation Shoemark, DKWilliams, CFahey, MSWatson, JJTyler, SJScoltock, SJEllis, RZWickenden, EBurton, AJHemmings, JLBailey, CDDawbarn, DJane, DEWillis, CLSessions, RBAllen, SJCrump, MP Design and nuclear magnetic resonance (NMR) structure determination of the second extracellular immunoglobulin tyrosine kinase A (TrkAIg2) domain construct for binding site elucidation in drug discovery. J Med Chem58:767-77 (2015) 
 
High affinity nerve growth factor receptor
Name:High affinity nerve growth factor receptor
Type:n/a
Mol. Mass.:87498.18
Organism:Homo sapiens (Human)
Description:P04629
Residue:796
BDBM50020712
NameBDBM50020712
Synonyms:10,11-dihydro-5-(gamma-dimethylaminopropylidene)-5H-dibenzo(a,d)cycloheptene 3-(10,11-dihydro-5H-dibenzo(a,d)cyclohepten-5-ylidene)-N,N-dimethyl-1-propanamine 3-(10,11-dihydro-5H-dibenzo[a,d]cyclohepten-5-ylidene)-N,N-dimethylpropan-1-amine 5-(3-dimethylaminopropylidene)-10,11-dihydro-5H-dibenzo(a,d)cycloheptene AMITRIPTYLINE CHEMBL629
TypeSmall organic molecule
Emp. Form.C20H23N
Mol. Mass.277.4033
SMILES[#6]-[#7](-[#6])-[#6]-[#6]\[#6]=[#6]-1/c2ccccc2-[#6]-[#6]-c2ccccc-12