Reaction Details
TargetHistamine H4 receptor
LigandBDBM50061008
Substrate/Competitorn/a
Meas. Tech.ChEMBL_1461283 (CHEMBL3396057)
Ki 8.0±n/a nM
Citation Savall, BMMeduna, SPTays, KCai, HThurmond, RLMcGovern, PGaul, MZhao, BPEdwards, JP Diaminopyrimidines, diaminopyridines and diaminopyridazines as histamine H4 receptor modulators. Bioorg Med Chem Lett25:956-9 (2015) 
 
Histamine H4 receptor
Name:Histamine H4 receptor
Type:G Protein-Coupled Receptor (GPCR)
Mol. Mass.:44517.02
Organism:Homo sapiens (Human)
Description:Binding assays were using CHO cells stably expressing hH4R receptors.
Residue:390
BDBM50061008
NameBDBM50061008
Synonyms:CHEMBL3393556 | US9732087, 96
TypeSmall organic molecule
Emp. Form.C16H25N5
Mol. Mass.287.4032
SMILESCN[C@@H]1CCN(C1)c1cnnc(NC2CC3CCC2C3)c1