Reaction Details
TargetGrowth hormone secretagogue receptor type 1
LigandBDBM50061720
Substrate/Competitorn/a
Meas. Tech.ChEMBL_1461883 (CHEMBL3396113)
Ki 13±n/a nM
Citation Orr, STBeveridge, RBhattacharya, SKCameron, KOCoffey, SFernando, DHepworth, DJackson, MVKhot, VKosa, RLapham, KLoria, PMMcClure, KFPatel, JRose, CSaenz, JStock, IAStorer, Gvon Volkenburg, MVrieze, DWang, GXiao, JZhang, Y Evaluation and synthesis of polar aryl- and heteroaryl spiroazetidine-piperidine acetamides as ghrelin inverse agonists. ACS Med Chem Lett6:156-61 (2015) 
 
Growth hormone secretagogue receptor type 1
Name:Growth hormone secretagogue receptor type 1
Type:Receptor
Mol. Mass.:41334.57
Organism:Homo sapiens (Human)
Description:Receptor binding studies use plasma membranes from LLC PK-1 cells transiently transfected with hGHSR1a.
Residue:366
BDBM50061720
NameBDBM50061720
Synonyms:CHEMBL3394199
TypeSmall organic molecule
Emp. Form.C31H33N5O2
Mol. Mass.507.626
SMILESCOc1ccc(CC(=O)N2CCC3(CN(C3)[C@@H]3CCc4cc(ccc34)-c3cc(C)ncn3)CC2)c(c1)C#N