Reaction Details
TargetGrowth hormone secretagogue receptor type 1
LigandBDBM50061725
Substrate/Competitorn/a
Meas. Tech.ChEMBL_1461883 (CHEMBL3396113)
Ki 6.4±n/a nM
Citation Orr, STBeveridge, RBhattacharya, SKCameron, KOCoffey, SFernando, DHepworth, DJackson, MVKhot, VKosa, RLapham, KLoria, PMMcClure, KFPatel, JRose, CSaenz, JStock, IAStorer, Gvon Volkenburg, MVrieze, DWang, GXiao, JZhang, Y Evaluation and synthesis of polar aryl- and heteroaryl spiroazetidine-piperidine acetamides as ghrelin inverse agonists. ACS Med Chem Lett6:156-61 (2015) 
 
Growth hormone secretagogue receptor type 1
Name:Growth hormone secretagogue receptor type 1
Type:Receptor
Mol. Mass.:41334.57
Organism:Homo sapiens (Human)
Description:Receptor binding studies use plasma membranes from LLC PK-1 cells transiently transfected with hGHSR1a.
Residue:366
BDBM50061725
NameBDBM50061725
Synonyms:CHEMBL3394195
TypeSmall organic molecule
Emp. Form.C31H35N5O
Mol. Mass.493.6425
SMILESCc1cc(ncn1)-c1ccc2[C@@H](CCc2c1)N1CC2(C1)CCN(CC2)C(=O)Cc1ccc(cn1)C1CC1