Reaction Details
TargetGrowth hormone secretagogue receptor type 1
LigandBDBM50019925
Substrate/Competitorn/a
Meas. Tech.ChEMBL_1461883 (CHEMBL3396113)
Ki 14±n/a nM
Citation Orr, STBeveridge, RBhattacharya, SKCameron, KOCoffey, SFernando, DHepworth, DJackson, MVKhot, VKosa, RLapham, KLoria, PMMcClure, KFPatel, JRose, CSaenz, JStock, IAStorer, Gvon Volkenburg, MVrieze, DWang, GXiao, JZhang, Y Evaluation and synthesis of polar aryl- and heteroaryl spiroazetidine-piperidine acetamides as ghrelin inverse agonists. ACS Med Chem Lett6:156-61 (2015) 
 
Growth hormone secretagogue receptor type 1
Name:Growth hormone secretagogue receptor type 1
Type:Receptor
Mol. Mass.:41334.57
Organism:Homo sapiens (Human)
Description:Receptor binding studies use plasma membranes from LLC PK-1 cells transiently transfected with hGHSR1a.
Residue:366
BDBM50019925
NameBDBM50019925
Synonyms:CHEMBL3287217
TypeSmall organic molecule
Emp. Form.C29H33N5O2
Mol. Mass.483.6046
SMILESCOc1ccc(CC(=O)N2CCC3(CN(C3)[C@@H]3CCc4cc(ccc34)-c3cc(C)ncn3)CC2)nc1