Reaction Details
Target5-hydroxytryptamine receptor 2B
LigandBDBM50440261
Substrate/Competitorn/a
Meas. Tech.ChEMBL_1461974 (CHEMBL3396352)
IC50 4300±n/a nM
Citation Orr, STBeveridge, RBhattacharya, SKCameron, KOCoffey, SFernando, DHepworth, DJackson, MVKhot, VKosa, RLapham, KLoria, PMMcClure, KFPatel, JRose, CSaenz, JStock, IAStorer, Gvon Volkenburg, MVrieze, DWang, GXiao, JZhang, Y Evaluation and synthesis of polar aryl- and heteroaryl spiroazetidine-piperidine acetamides as ghrelin inverse agonists. ACS Med Chem Lett6:156-61 (2015) 
 
5-hydroxytryptamine receptor 2B
Name:5-hydroxytryptamine receptor 2B
Type:G Protein-Coupled Receptor (GPCR)
Mol. Mass.:54312.47
Organism:Homo sapiens (Human)
Description:Receptor binding assays were performed using human clone stably expressed in CHO cells.
Residue:481
BDBM50440261
NameBDBM50440261
Synonyms:CHEMBL2426677
TypeSmall organic molecule
Emp. Form.C29H32N4O2
Mol. Mass.468.59
SMILESCOc1ccc(CC(=O)N2CCC3(CN(C3)[C@@H]3CCc4cc(ccc34)-c3ncccn3)CC2)cc1