Reaction Details
TargetPotassium voltage-gated channel subfamily H member 2
LigandBDBM50061874
Substrate/Competitorn/a
Meas. Tech.ChEMBL_1462014 (CHEMBL3396464)
Ki>15000±n/a nM
Citation Cheng, YBrown, JJudd, TCLopez, PQian, WPowers, TSChen, JJBartberger, MDChen, KDunn, RTEpstein, OFremeau, RTHarried, SHickman, DHitchcock, SALuo, YMinatti, AEPatel, VFVargas, HMWahl, RCWeiss, MMWen, PHWhite, RDWhittington, DAZheng, XMWood, S An Orally Available BACE1 Inhibitor That Affords Robust CNS Aß Reduction without Cardiovascular Liabilities. ACS Med Chem Lett6:210-5 (2015) 
 
Potassium voltage-gated channel subfamily H member 2
Name:Potassium voltage-gated channel subfamily H member 2
Type:Multi-pass membrane protein
Mol. Mass.:126672.65
Organism:Homo sapiens (Human)
Description:Q12809
Residue:1159
BDBM50061874
NameBDBM50061874
Synonyms:CHEMBL3394210
TypeSmall organic molecule
Emp. Form.C25H16F2N4O2
Mol. Mass.442.4169
SMILESNC1=N[C@@]2(CO1)c1cc(ccc1Oc1c(F)nc(cc21)-c1ccccc1)-c1cccnc1F