Reaction Details
TargetBeta-secretase 1
LigandBDBM50061890
Substrate/Competitorn/a
Meas. Tech.ChEMBL_1462007 (CHEMBL3396457)
IC50 0.300000±n/a nM
Citation Cheng, YBrown, JJudd, TCLopez, PQian, WPowers, TSChen, JJBartberger, MDChen, KDunn, RTEpstein, OFremeau, RTHarried, SHickman, DHitchcock, SALuo, YMinatti, AEPatel, VFVargas, HMWahl, RCWeiss, MMWen, PHWhite, RDWhittington, DAZheng, XMWood, S An Orally Available BACE1 Inhibitor That Affords Robust CNS Aß Reduction without Cardiovascular Liabilities. ACS Med Chem Lett6:210-5 (2015) 
 
Beta-secretase 1
Name:Beta-secretase 1
Type:Protein
Mol. Mass.:55755.10
Organism:Homo sapiens (Human)
Description:P56817
Residue:501
BDBM50061890
NameBDBM50061890
Synonyms:CHEMBL3394211
TypeSmall organic molecule
Emp. Form.C24H15F2N5O2
Mol. Mass.443.405
SMILESNC1=N[C@@]2(CO1)c1cc(ccc1Oc1c(F)nc(cc21)-c1cccnc1)-c1cccnc1F