Reaction Details
TargetCannabinoid receptor 1
LigandBDBM50062499
Substrate/Competitorn/a
Meas. Tech.ChEMBL_1462819 (CHEMBL3399658)
Ki 1530±n/a nM
Citation Bertini, SParkkari, TSavinainen, JRArena, CSaccomanni, GSaguto, SLigresti, AAllarà, MBruno, AMarinelli, LDi Marzo, VNovellino, EManera, CMacchia, M Synthesis, biological activity and molecular modeling of new biphenylic carboxamides as potent and selective CB2 receptor ligands. Eur J Med Chem90:526-36 (2015) 
 
Cannabinoid receptor 1
Name:Cannabinoid receptor 1
Type:G Protein-Coupled Receptor (GPCR)
Mol. Mass.:52868.96
Organism:Homo sapiens (Human)
Description:P21554
Residue:472
BDBM50062499
NameBDBM50062499
Synonyms:CHEMBL3397449
TypeSmall organic molecule
Emp. Form.C22H27NO2
Mol. Mass.337.4553
SMILESCOc1c(C)cc(cc1C(=O)N[C@H]1CC[C@H](C)CC1)-c1ccccc1