Reaction Details
TargetCannabinoid receptor 2
LigandBDBM50062507
Substrate/Competitorn/a
Meas. Tech.ChEMBL_1462820 (CHEMBL3399659)
Ki 143±n/a nM
Citation Bertini, SParkkari, TSavinainen, JRArena, CSaccomanni, GSaguto, SLigresti, AAllarà, MBruno, AMarinelli, LDi Marzo, VNovellino, EManera, CMacchia, M Synthesis, biological activity and molecular modeling of new biphenylic carboxamides as potent and selective CB2 receptor ligands. Eur J Med Chem90:526-36 (2015) 
 
Cannabinoid receptor 2
Name:Cannabinoid receptor 2
Type:G Protein-Coupled Receptor (GPCR)
Mol. Mass.:39690.94
Organism:Homo sapiens (Human)
Description:P34972
Residue:360
BDBM50062507
NameBDBM50062507
Synonyms:CHEMBL3397521
TypeSmall organic molecule
Emp. Form.C26H35NO3
Mol. Mass.409.561
SMILESCCCCc1cc(cc(C(=O)N[C@H]2CC[C@H](C)CC2)c1OC)-c1ccc(OC)cc1