Reaction Details
TargetCannabinoid receptor 2
LigandBDBM50062496
Substrate/Competitorn/a
Meas. Tech.ChEMBL_1462820 (CHEMBL3399659)
Ki>10000±n/a nM
Citation Bertini, SParkkari, TSavinainen, JRArena, CSaccomanni, GSaguto, SLigresti, AAllarà, MBruno, AMarinelli, LDi Marzo, VNovellino, EManera, CMacchia, M Synthesis, biological activity and molecular modeling of new biphenylic carboxamides as potent and selective CB2 receptor ligands. Eur J Med Chem90:526-36 (2015) 
 
Cannabinoid receptor 2
Name:Cannabinoid receptor 2
Type:G Protein-Coupled Receptor (GPCR)
Mol. Mass.:39690.94
Organism:Homo sapiens (Human)
Description:P34972
Residue:360
BDBM50062496
NameBDBM50062496
Synonyms:CHEMBL3397446
TypeSmall organic molecule
Emp. Form.C23H29NO3
Mol. Mass.367.4813
SMILESCOc1ccc(cc1)-c1cc(C)c(OC)c(c1)C(=O)N[C@H]1CC[C@H](C)CC1