Reaction Details
TargetTelomerase reverse transcriptase
LigandBDBM50105463
Substrate/Competitorn/a
Meas. Tech.ChEMBL_1462923 (CHEMBL3399863)
IC50 2100±n/a nM
Citation Shi, JBTang, WJQi, XBLi, RLiu, XH Novel pyrazole-5-carboxamide and pyrazole-pyrimidine derivatives: synthesis and anticancer activity. Eur J Med Chem90:889-96 (2015) 
 
Telomerase reverse transcriptase
Name:Telomerase reverse transcriptase
Type:PROTEIN
Mol. Mass.:127099.03
Organism:Homo sapiens (Human)
Description:ChEMBL_1447029
Residue:1132
BDBM50105463
NameBDBM50105463
Synonyms:2,7-diamino-10-ethyl-9-phenylphenanthridinium bromide 3,8-diamino-5-ethyl-6-phenylphenanthridinium bromide Dromilac Ethidium bromide | Homidium bromide
TypeSmall organic molecule
Emp. Form.C21H20N3
Mol. Mass.314.4031
SMILESCCn1c(-c2ccccc2)c2cc(N)ccc2c2ccc(=[NH2+])cc12