Reaction Details
TargetReverse transcriptase
LigandBDBM50063004
Substrate/Competitorn/a
Meas. Tech.ChEMBL_1463313 (CHEMBL3399540)
IC50 79280±n/a nM
Citation Babkov, DAValuev-Elliston, VTParamonova, MPOzerov, AAIvanov, AVChizhov, AOKhandazhinskaya, ALKochetkov, SNBalzarini, JDaelemans, DPannecouque, CSeley-Radtke, KLNovikov, MS Scaffold hopping: exploration of acetanilide-containing uracil analogues as potential NNRTIs. Bioorg Med Chem23:1069-81 (2015) 
 
Reverse transcriptase
Name:Reverse transcriptase
Synonyms:n/a
Type:Protein
Mol. Mass.:29598.37
Organism:Human immunodeficiency virus 1
Description:Q9WKE8
Residue:254
BDBM50063004
NameBDBM50063004
Synonyms:CHEMBL3398093
TypeSmall organic molecule
Emp. Form.C21H21N3O3
Mol. Mass.363.4097
SMILESCc1cc(C)cc(Cn2c(=O)ccn(CC(=O)Nc3ccccc3)c2=O)c1