Reaction Details
TargetReverse transcriptase
LigandBDBM50063005
Substrate/Competitorn/a
Meas. Tech.ChEMBL_1463313 (CHEMBL3399540)
IC50 68770±n/a nM
Citation Babkov, DAValuev-Elliston, VTParamonova, MPOzerov, AAIvanov, AVChizhov, AOKhandazhinskaya, ALKochetkov, SNBalzarini, JDaelemans, DPannecouque, CSeley-Radtke, KLNovikov, MS Scaffold hopping: exploration of acetanilide-containing uracil analogues as potential NNRTIs. Bioorg Med Chem23:1069-81 (2015) 
 
Reverse transcriptase
Name:Reverse transcriptase
Synonyms:n/a
Type:Protein
Mol. Mass.:29598.37
Organism:Human immunodeficiency virus 1
Description:Q9WKE8
Residue:254
BDBM50063005
NameBDBM50063005
Synonyms:CHEMBL3398094
TypeSmall organic molecule
Emp. Form.C22H23N3O3
Mol. Mass.377.4363
SMILESCc1cc(C)cc(Cn2c(=O)ccn(CC(=O)Nc3ccccc3C)c2=O)c1