Reaction Details
TargetReverse transcriptase
LigandBDBM50063020
Substrate/Competitorn/a
Meas. Tech.ChEMBL_1463313 (CHEMBL3399540)
Ki>100000±n/a nM
Citation Babkov, DAValuev-Elliston, VTParamonova, MPOzerov, AAIvanov, AVChizhov, AOKhandazhinskaya, ALKochetkov, SNBalzarini, JDaelemans, DPannecouque, CSeley-Radtke, KLNovikov, MS Scaffold hopping: exploration of acetanilide-containing uracil analogues as potential NNRTIs. Bioorg Med Chem23:1069-81 (2015) 
 
Reverse transcriptase
Name:Reverse transcriptase
Synonyms:n/a
Type:Protein
Mol. Mass.:29598.37
Organism:Human immunodeficiency virus 1
Description:Q9WKE8
Residue:254
BDBM50063020
NameBDBM50063020
Synonyms:CHEMBL3398088
TypeSmall organic molecule
Emp. Form.C22H22ClN3O4
Mol. Mass.427.881
SMILESCCCn1c(=O)ccn(Cc2ccccc2OCC(=O)Nc2ccccc2Cl)c1=O