Reaction Details
TargetCytochrome P450 26A1
LigandBDBM50063075
Substrate/Competitorn/a
Meas. Tech.ChEMBL_1462611 (CHEMBL3399274)
IC50 3020±n/a nM
Citation Zhao, DSun, BRen, JLi, FSong, SLv, XHao, CCheng, M Synthesis and biological evaluation of 3-phenyl-3-aryl carboxamido propanoic acid derivatives as small molecule inhibitors of retinoic acid 4-hydroxylase (CYP26A1). Bioorg Med Chem23:1356-65 (2015) 
 
Cytochrome P450 26A1
Name:Cytochrome P450 26A1
Type:Enzyme
Mol. Mass.:56216.16
Organism:Homo sapiens (Human)
Description:O43174
Residue:497
BDBM50063075
NameBDBM50063075
Synonyms:CHEMBL3398405
TypeSmall organic molecule
Emp. Form.C19H22ClNO4
Mol. Mass.363.835
SMILESCc1oc(cc1C(=O)NC(CC(O)=O)c1ccc(Cl)cc1)C(C)(C)C