Reaction Details
TargetCytochrome P450 26A1
LigandBDBM50063076
Substrate/Competitorn/a
Meas. Tech.ChEMBL_1462611 (CHEMBL3399274)
IC50 1870±n/a nM
Citation Zhao, DSun, BRen, JLi, FSong, SLv, XHao, CCheng, M Synthesis and biological evaluation of 3-phenyl-3-aryl carboxamido propanoic acid derivatives as small molecule inhibitors of retinoic acid 4-hydroxylase (CYP26A1). Bioorg Med Chem23:1356-65 (2015) 
 
Cytochrome P450 26A1
Name:Cytochrome P450 26A1
Type:Enzyme
Mol. Mass.:56216.16
Organism:Homo sapiens (Human)
Description:O43174
Residue:497
BDBM50063076
NameBDBM50063076
Synonyms:CHEMBL3398420
TypeSmall organic molecule
Emp. Form.C20H17BrClN3O3
Mol. Mass.462.724
SMILESCc1nn(c(Cl)c1C(=O)NC(CC(O)=O)c1cccc(Br)c1)-c1ccccc1