Reaction Details
TargetCannabinoid receptor 2
LigandBDBM50063901
Substrate/Competitorn/a
Meas. Tech.ChEMBL_1464106 (CHEMBL3406632)
EC50 0.770000±n/a nM
Citation Hickey, ERZindell, RCirillo, PFWu, LErmann, MBerry, AKThomson, DSAlbrecht, CGemkow, MJRiether, D Selective CB2 receptor agonists. Part 1: the identification of novel ligands through computer-aided drug design (CADD) approaches. Bioorg Med Chem Lett25:575-80 (2015) 
 
Cannabinoid receptor 2
Name:Cannabinoid receptor 2
Type:G Protein-Coupled Receptor (GPCR)
Mol. Mass.:39690.94
Organism:Homo sapiens (Human)
Description:P34972
Residue:360
BDBM50063901
NameBDBM50063901
Synonyms:CHEMBL3400937
TypeSmall organic molecule
Emp. Form.C18H21F3N2O4S
Mol. Mass.418.431
SMILESCC(C)(C)c1cc(NC(=O)C(C)(C)S(=O)(=O)c2ccc(cc2)C(F)(F)F)no1