Reaction Details
TargetAmine oxidase [flavin-containing] B
LigandBDBM50172756
Substrate/Competitorn/a
Meas. Tech.ChEMBL_1464362 (CHEMBL3404821)
Kd 275±n/a nM
Citation Rojas, RJEdmondson, DEAlmos, TScott, RMassari, ME Reversible and irreversible small molecule inhibitors of monoamine oxidase B (MAO-B) investigated by biophysical techniques. Bioorg Med Chem23:770-8 (2015) 
 
Amine oxidase [flavin-containing] B
Name:Amine oxidase [flavin-containing] B
Type:Protein
Mol. Mass.:58768.76
Organism:Homo sapiens (Human)
Description:P27338
Residue:520
BDBM50172756
NameBDBM50172756
Synonyms:Benzyl-methyl-prop-2-ynyl-amine Eutonyl N-benzyl-N-methylprop-2-yn-1-amine US9603833, Pargyline
TypeSmall organic molecule
Emp. Form.C11H13N
Mol. Mass.159.2276
SMILESCN(CC#C)Cc1ccccc1