Reaction Details
TargetSodium/glucose cotransporter 2
LigandBDBM20880
Substrate/Competitorn/a
Meas. Tech.ChEMBL_1464685 (CHEMBL3406875)
IC50 5.0±n/a nM
Citation Zhou, JXu, JHuang, ZWang, M Transporter-mediated tissue targeting of therapeutic molecules in drug discovery. Bioorg Med Chem Lett25:993-7 (2015) 
 
Sodium/glucose cotransporter 2
Name:Sodium/glucose cotransporter 2
Type:Protein
Mol. Mass.:72902.00
Organism:Homo sapiens (Human)
Description:P31639
Residue:672
BDBM20880
NameBDBM20880
Synonyms:(2S,3R,4R,5S,6R)-2-{4-chloro-3-[(4-ethoxyphenyl)methyl]phenyl}-6-(hydroxymethyl)oxane-3,4,5-triol C-aryl glucoside, 6 Dapagliflozin
TypeSmall organic molecule
Emp. Form.C21H25ClO6
Mol. Mass.408.873
SMILESCCOc1ccc(Cc2cc(ccc2Cl)[C@@H]2O[C@H](CO)[C@@H](O)[C@H](O)[C@H]2O)cc1