Reaction Details
TargetHormone-sensitive lipase
LigandBDBM50064422
Substrate/Competitorn/a
Meas. Tech.ChEMBL_1464915 (CHEMBL3404385)
Ki 40±n/a nM
Citation Vasilieva, EDutta, SMalla, RKMartin, BPSpilling, CDDupureur, CM Rat hormone sensitive lipase inhibition by cyclipostins and their analogs. Bioorg Med Chem23:944-52 (2015) 
 
Hormone-sensitive lipase
Name:Hormone-sensitive lipase
Type:Enzyme
Mol. Mass.:116814.94
Organism:Rattus norvegicus (Rat)
Description:P15304
Residue:1068
BDBM50064422
NameBDBM50064422
Synonyms:CHEMBL3401162
TypeSmall organic molecule
Emp. Form.C23H41O6P
Mol. Mass.444.5418
SMILES[H][C@@]12COC(=O)C1=C(C)O[P@](=O)(OCCCCCCCCCCCCCCCC)OC2