Reaction Details
TargetMonoglyceride lipase
LigandBDBM50132713
Substrate/Competitorn/a
Meas. Tech.ChEMBL_1464520 (CHEMBL3405834)
IC50 28±n/a nM
Citation Patel, JZAhenkorah, SVaara, MStaszewski, MAdams, YLaitinen, TNavia-Paldanius, DParkkari, TSavinainen, JRWalczynski, KLaitinen, JTNevalainen, TJ Loratadine analogues as MAGL inhibitors. Bioorg Med Chem Lett25:1436-42 (2015) 
 
Monoglyceride lipase
Name:Monoglyceride lipase
Type:Hydrolase
Mol. Mass.:33264.56
Organism:Homo sapiens (Human)
Description:Human recombinant MGL (Cayman Chemical, cat# 10008354).
Residue:303
BDBM50132713
NameBDBM50132713
Synonyms:Arachidonic acid derivative Methyl arachidonoyl fluorophophonate methyl (5Z,8Z,11Z,14Z)-icosa-5,8,11,14-tetraenylphosphonofluoridate methyl(5Z,8Z,11Z,14Z)-icosa-5,8,11,14-tetraenylphosphonofluoridate | methylarachidonyl fluorophosphonate
TypeSmall organic molecule
Emp. Form.C21H36FO2P
Mol. Mass.370.4815
SMILESCCCCC\C=C/C\C=C/C\C=C/C\C=C/CCCCP(F)(=O)OC