Reaction Details
TargetGastrin-releasing peptide receptor
LigandBDBM50066009
Substrate/Competitorn/a
Meas. Tech.ChEMBL_1464741 (CHEMBL3407092)
IC50 0.600000±n/a nM
Citation Pourghiasian, MLiu, ZPan, JZhang, ZColpo, NLin, KSPerrin, DMBénard, F (18)F-AmBF3-MJ9: a novel radiofluorinated bombesin derivative for prostate cancer imaging. Bioorg Med Chem23:1500-6 (2015) 
 
Gastrin-releasing peptide receptor
Name:Gastrin-releasing peptide receptor
Type:Enzyme Catalytic Domain
Mol. Mass.:43214.53
Organism:Homo sapiens (Human)
Description:Bombesin 2 GRPR 0::P30550
Residue:384
BDBM50066009
NameBDBM50066009
Synonyms:CHEMBL3401466
TypeSmall organic molecule
Emp. Form.C70H104BF3N20O13
Mol. Mass.1501.507
SMILESCC(C)C[C@H](NC(=O)[C@H](Cc1cnc[nH]1)NC(=O)CNC(=O)[C@@H](NC(=O)[C@H](C)NC(=O)[C@H](Cc1c[nH]c2ccccc12)NC(=O)[C@H](CCC(N)=O)NC(=O)[C@@H](Cc1ccccc1)NC(=O)CN1CCC(CC1)NC(=O)Cn1cc(C[N+](C)(C)C[B-](F)(F)F)nn1)C(C)C)[C@@H](O)CC(=O)N[C@@H](CC(C)C)C(N)=O