Reaction Details
TargetCarbonic anhydrase 7
LigandBDBM50066127
Substrate/Competitorn/a
Meas. Tech.ChEMBL_1465101 (CHEMBL3405433)
Ki 8.9±n/a nM
Citation Carta, FDi Cesare Mannelli, LPinard, MGhelardini, CScozzafava, AMcKenna, RSupuran, CT A class of sulfonamide carbonic anhydrase inhibitors with neuropathic pain modulating effects. Bioorg Med Chem23:1828-40 (2015) 
 
Carbonic anhydrase 7
Name:Carbonic anhydrase 7
Type:Enzyme
Mol. Mass.:29664.11
Organism:Homo sapiens (Human)
Description:Human cloned isozyme.
Residue:264
BDBM50066127
NameBDBM50066127
Synonyms:CHEMBL3402965
TypeSmall organic molecule
Emp. Form.C13H12BrNO3S
Mol. Mass.342.208
SMILESNS(=O)(=O)c1ccc(OCc2ccc(Br)cc2)cc1