Reaction Details
TargetCarbonic anhydrase 7
LigandBDBM50066123
Substrate/Competitorn/a
Meas. Tech.ChEMBL_1465101 (CHEMBL3405433)
Ki 71±n/a nM
Citation Carta, FDi Cesare Mannelli, LPinard, MGhelardini, CScozzafava, AMcKenna, RSupuran, CT A class of sulfonamide carbonic anhydrase inhibitors with neuropathic pain modulating effects. Bioorg Med Chem23:1828-40 (2015) 
 
Carbonic anhydrase 7
Name:Carbonic anhydrase 7
Type:Enzyme
Mol. Mass.:29664.11
Organism:Homo sapiens (Human)
Description:Human cloned isozyme.
Residue:264
BDBM50066123
NameBDBM50066123
Synonyms:CHEMBL3402969
TypeSmall organic molecule
Emp. Form.C20H19NO3S
Mol. Mass.353.435
SMILESNS(=O)(=O)c1ccc(OCC(c2ccccc2)c2ccccc2)cc1