Reaction Details
TargetCarbonic anhydrase 7
LigandBDBM50066121
Substrate/Competitorn/a
Meas. Tech.ChEMBL_1465101 (CHEMBL3405433)
Ki 7.7±n/a nM
Citation Carta, FDi Cesare Mannelli, LPinard, MGhelardini, CScozzafava, AMcKenna, RSupuran, CT A class of sulfonamide carbonic anhydrase inhibitors with neuropathic pain modulating effects. Bioorg Med Chem23:1828-40 (2015) 
 
Carbonic anhydrase 7
Name:Carbonic anhydrase 7
Type:Enzyme
Mol. Mass.:29664.11
Organism:Homo sapiens (Human)
Description:Human cloned isozyme.
Residue:264
BDBM50066121
NameBDBM50066121
Synonyms:CHEMBL3402971
TypeSmall organic molecule
Emp. Form.C14H12N2O3S2
Mol. Mass.320.387
SMILESNS(=O)(=O)c1nc2ccc(OCc3ccccc3)cc2s1